﻿"Item Id","Item URI","Dublin Core:Title","Dublin Core:Creator","Dublin Core:Description","Dublin Core:Identifier","Dublin Core:Subject","Dublin Core:Coverage","Dublin Core:Source","Dublin Core:Publisher","Dublin Core:Date","Dublin Core:Contributor","Dublin Core:Rights","Dublin Core:Relation","Dublin Core:Format","Dublin Core:Language","Dublin Core:Type","Item Type Metadata:Lesson Plan Text","Item Type Metadata:Bibliography","Item Type Metadata:Biographical Text","Item Type Metadata:Occupation","Item Type Metadata:Death Date","Item Type Metadata:Birthplace","Item Type Metadata:Birth Date","Item Type Metadata:Participants","Item Type Metadata:Event Type","Item Type Metadata:URL","Item Type Metadata:Bit Rate/Frequency","Item Type Metadata:Interviewer","Item Type Metadata:Interviewee","Item Type Metadata:Location","Item Type Metadata:Transcription","Item Type Metadata:Local URL","Item Type Metadata:Original Format","Item Type Metadata:Physical Dimensions","Item Type Metadata:Duration","Item Type Metadata:Compression","Item Type Metadata:Producer","Item Type Metadata:Director","Item Type Metadata:Text","Item Type Metadata:Time Summary","Item Type Metadata:Email Body","Item Type Metadata:Subject Line","Item Type Metadata:From","Item Type Metadata:To","Item Type Metadata:CC","Item Type Metadata:BCC","Item Type Metadata:Number of Attachments","Item Type Metadata:Standards","Item Type Metadata:Objectives","Item Type Metadata:Materials",tags,file,itemType,collection,public,featured
366,https://witness.digitalscholarship.emory.edu/items/show/366,"""Representative Izac looks at skulls and bodies... in an incinerator""  [Buchenwald]","Izac, Edouard Victor Michel (Donor)^^United States--Army--Signal Corps (Photographer)","Content Note: Title from caption on a separate page.  Additional caption text: ""Rep. Izac looks at skulls and bodies of prisoners in an incinerator at the infamous Buchenwald Nazi concentration camp near Weimar.  Rep. Izac is a member of a congressional group witnessing evidence of Nazi atrocities.""  Close-up of Rep. Izac looking into an incinerator containing human remains.  The contents of the incinerator are visible through the open doors.  Numbered 28 on the reverse (Izac 9)","06080100PHBU00IZACED004^^ 06080100PHBU00IZACED004.JPG ","Buchenwald (Concentration camp)^^United States--Congress--Joint Committee on Conditions in Concentration Camps in Germany^^United States--Army--Signal Corps^^Izac, Edouard Victor Michel",,"1 silver gelatin print Image size: 4 1/2"" x 6 1/2"";  Paper size: 5"" x 7 1/8"" bent, scratches, fingerprints, damage on negative.  Reverse of  photo: paper label, writing.",,"4 -  24 - 1945","Emory University^^Encoded as part of the SAGE Digital Archive Project: A Collaborative Project between the Georgia Institute of Technology and Emory University, 1997-2000.^^Funding for the SAGE Digital Archive Project was provided by a local foundation.","Researchers should contact the repository for terms governing the use of the collection.","Negative.  TIFF image (400 dpi).  JPG image (72 dpi).","JPG (72 dpi); 55 KB  Digital image created as part of SAGE project, 1998.",,,,,,,,,,,,,,,,,,,,,,,,,,,,,,,,,,,,,"Buchenwald (Concentration camp),Izac, Edouard Victor Michel,United States--Army--Signal Corps,United States--Congress--Joint Committee on Conditions in Concentration Camps in Germany",https://witness.digitalscholarship.emory.edu/files/original/5295da3b58895e97bf7b04ed2b896f44.JPG,"Still Image",Photographs,1,0
606,https://witness.digitalscholarship.emory.edu/items/show/606,"""Senators and representatives of the U.S. Congress... are welcomed by Maj. Gen. Lowell W. Rooks""","Izac, Edouard Victor Michel (Donor)","Content Note: Title from caption on a separate page.  Additional caption text: ""Senators and representatives of the U.S. Congress have arrived in Germany to investigate conditions in the concentration camps and D.P. camps are welcomed by Maj. Gen. Lowell W. Rooks.  They proceeded at once to a nearby Russian refugee camp where they had a talk with a Russian colonel in charge. Then the party headed for Seventh Army headquarters where Lt. Gen. Alexander M. Patch received them.  After a short stay, Gen. Patch accompanied the party to Munich where it will visit Dachau.  Gen. Patch is with Izac and Short.""  They are standing together near a multi-story building.  Numbered 13 on the reverse (Izac 51)","06080100PHMI00IZACED008^^ 06080100PHMI00IZACED008.JPG ","United States--Congress--Joint Committee on Conditions in Concentration Camps in Germany^^Rooks, Lowell W.^^Patch, Alexander McCarrell^^Short, Dewey J.^^Izac, Edouard Victor Michel",Germany,"1 silver gelatin print Image size: 4 1/2"" x 6 1/2"";  Paper size: 5"" x 7"" bent, scratches, moisture wrinkling, bottom edge of photograph  is uneven as if ripped along a ruler.  Reverse of photo:  paper label, writing.",,"5 -  2 - 1945","Emory University^^Encoded as part of the SAGE Digital Archive Project: A Collaborative Project between the Georgia Institute of Technology and Emory University, 1997-2000.^^Funding for the SAGE Digital Archive Project was provided by a local foundation.","Researchers should contact the repository for terms governing the use of the collection.","Negative.  TIFF image (400 dpi).  JPG image (72 dpi).","JPG (72 dpi); 61 KB  Digital image created as part of SAGE project, 1998.",,,,,,,,,,,,,,,,,,,,,,,,,,,,,,,,,,,,,"Germany,Izac, Edouard Victor Michel,Patch, Alexander McCarrell,Rooks, Lowell W.,Short, Dewey J.,United States--Congress--Joint Committee on Conditions in Concentration Camps in Germany",https://witness.digitalscholarship.emory.edu/files/original/e5e1c8c119a0731fe11ca9b1f5ffdb5e.JPG,"Still Image",Photographs,1,0
365,https://witness.digitalscholarship.emory.edu/items/show/365,"""U.S. legislators... hear former prisoner demonstrate how victims were... clubbed to death"" [Buchenwald]","Izac, Edouard Victor Michel (Donor)^^United States--Army--Signal Corps (Photographer)","Content Note: Title from caption on a separate page.  Additional caption text: ""U.S. legislators in Germany to witness Nazi concentration camp horrors at Buchenwald hear former prisoner demonstrate how victims were hung on hooks and then clubbed to death.  L-R: Thomason, Mott,  Brooks, Wherry, Barkley, Short, Vorys.  Former prisoner is shown holding club.""  The survivor is wearing a coat with the number 38210 on the front under a triangle and ""Lagerschutz"" on the left sleeve.  Numbered 9 on the reverse (Izac 7)","06080100PHBU00IZACED003^^ 06080100PHBU00IZACED003.JPG ","Buchenwald (Concentration camp)^^United States--Congress--Joint Committee on Conditions in Concentration Camps in Germany^^Thomason, R. Ewing^^Mott, James Wheaton^^Brooks, C. Wayland^^Wherry, Kenneth Spicer^^Barkley, Alben William^^Short, Dewey J.^^Vorys, John M.^^Izac, Edouard Victor Michel",,"1 silver gelatin print Image size: 4 1/2"" x 6 9/16"";  Paper size: 5"" x 7 1/16"" bent, scratches, damage on negative.  Reverse of photo: paper  label, writing.",,"4 -  24 - 1945","Emory University^^Encoded as part of the SAGE Digital Archive Project: A Collaborative Project between the Georgia Institute of Technology and Emory University, 1997-2000.^^Funding for the SAGE Digital Archive Project was provided by a local foundation.","Researchers should contact the repository for terms governing the use of the collection.","Negative.  TIFF image (400 dpi).  JPG image (72 dpi).","JPG (72 dpi); 46 KB  Digital image created as part of SAGE project, 1998.",,,,,,,,,,,,,,,,,,,,,,,,,,,,,,,,,,,,,"Barkley, Alben William,Brooks, C. Wayland,Buchenwald (Concentration camp),Izac, Edouard Victor Michel,Mott, James Wheaton,Short, Dewey J.,Thomason, R. Ewing,United States--Congress--Joint Committee on Conditions in Concentration Camps in Germany,Vorys, John M.,Wherry, Kenneth Spicer",https://witness.digitalscholarship.emory.edu/files/original/c49da91b7afc10cea1cd2d18b339f670.JPG,"Still Image",Photographs,1,0
370,https://witness.digitalscholarship.emory.edu/items/show/370,"Congressional Committee talks to child survivors  [Buchenwald]","Izac, Edouard Victor Michel (Donor)","Content Note: Caption from a separate page: ""Talking to children inmates: Richards, Wherry, Barkley, Brooks, Mott, Izac, Thomason, Short, Vorys.""  The children are wearing prisoner uniforms and hold musical instruments.  The congressional delegation stands behind them.  They appear to be in an office.  Numbered 44 on the reverse (Izac 14)","06080100PHBU00IZACED008^^ 06080100PHBU00IZACED008.JPG ","Buchenwald (Concentration camp)^^United States--Congress--Joint Committee on Conditions in Concentration Camps in Germany^^Richards, James P.^^Wherry, Kenneth Spicer^^Barkley, Alben William^^Brooks, C. Wayland^^Mott, James Wheaton^^Thomason, R. Ewing^^Short, Dewey J.^^Vorys, John M.^^Izac, Edouard Victor Michel",,"1 silver gelatin print Image size: 4 1/2"" x 6 1/2"";  Paper size: 5"" x 7 1/8"" bent, scratches, damage on negative.  Reverse of photo: paper  label, writing.",,"1 -  1 - 1945","Emory University^^Encoded as part of the SAGE Digital Archive Project: A Collaborative Project between the Georgia Institute of Technology and Emory University, 1997-2000.^^Funding for the SAGE Digital Archive Project was provided by a local foundation.","Researchers should contact the repository for terms governing the use of the collection.","Negative.  TIFF image (400 dpi).  JPG image (72 dpi).","JPG (72 dpi); 51 KB  Digital image created as part of SAGE project, 1998.",,,,,,,,,,,,,,,,,,,,,,,,,,,,,,,,,,,,,"Barkley, Alben William,Brooks, C. Wayland,Buchenwald (Concentration camp),Izac, Edouard Victor Michel,Mott, James Wheaton,Richards, James P.,Short, Dewey J.,Thomason, R. Ewing,United States--Congress--Joint Committee on Conditions in Concentration Camps in Germany,Vorys, John M.,Wherry, Kenneth Spicer",https://witness.digitalscholarship.emory.edu/files/original/71b6abd9d684fafddeb99e5114f2cbde.JPG,"Still Image",Photographs,1,0
369,https://witness.digitalscholarship.emory.edu/items/show/369,"Congressional committee talks to survivors hospitalized at Buchenwald","Izac, Edouard Victor Michel (Donor)","Content Note: Caption from a separate page: ""Members of Congressional committee talk to some of the former prisoners of Buchenwald now hospitalized at the camp.  Identifiable in the picture are Brooks; Brig. Gen. Frank R. Allen, SHAEF Public Relations Department; Brig. Gen. John M.   Weir, War Department Representative; Barkely.""  The survivors are lying on the floor under quilted covers.  One survivor wearing a white coat is standing and pointing to those on the floor.  Numbered 40 on the reverse (Izac 13)","06080100PHBU00IZACED007^^ 06080100PHBU00IZACED007.JPG ","Buchenwald (Concentration camp)^^United States--Congress--Joint Committee on Conditions in Concentration Camps in Germany^^Brooks, C. Wayland^^Allen, Frank R.^^Weir, John M.^^Barkley, Alben William^^Izac, Edouard Victor Michel",,"1 silver gelatin print Image size: 4 1/2"" x 6 1/2"";  Paper size: 5"" x 7 1/8"" bent, scratches, moisture wrinkling.  Reverse of photo: paper  label, dirt/staining, writing.",,"1 -  1 - 1945","Emory University^^Encoded as part of the SAGE Digital Archive Project: A Collaborative Project between the Georgia Institute of Technology and Emory University, 1997-2000.^^Funding for the SAGE Digital Archive Project was provided by a local foundation.","Researchers should contact the repository for terms governing the use of the collection.","Negative.  TIFF image (400 dpi).  JPG image (72 dpi).","JPG (72 dpi); 44 KB  Digital image created as part of SAGE project, 1998.",,,,,,,,,,,,,,,,,,,,,,,,,,,,,,,,,,,,,"Allen, Frank R.,Barkley, Alben William,Brooks, C. Wayland,Buchenwald (Concentration camp),Izac, Edouard Victor Michel,United States--Congress--Joint Committee on Conditions in Concentration Camps in Germany,Weir, John M.",https://witness.digitalscholarship.emory.edu/files/original/6211cb9ab9cd7236d168d4b1e4e96fe2.JPG,"Still Image",Photographs,1,0
623,https://witness.digitalscholarship.emory.edu/items/show/623,"Congressional delegation view a V-bomb at an underground factory at Nordhausen","Izac, Edouard Victor Michel (Donor)^^United States--Army--Signal Corps (Photographer)","Content Note: Caption from a separate page: ""Members of a U. S. Cong. committee investigating German atrocities view a German V-Bomb in an underground factory at Nordhausen, Germany. (L-R) Rep. John Vorys, Rep. Ed. V. Izac, Sen. C. Wayland Brooks, Lt. Col. J. K. Beeson of Pittsburg, Penn., and Brig. Gen. John M. Weir, War Dept. Representative.""  The bomb is in the foreground with the committee members standing behind it.  Numbered 18 on the reverse  (Izac 46)","06080100PHNO00IZACED008^^ 06080100PHNO00IZACED008.JPG ","United States--Congress--Joint Committee on Conditions in Concentration Camps in Germany^^Nordhausen (Concentration camp)^^Dora (Concentration camp)^^Vorys, John M.^^Brooks, C. Wayland^^Beeson, J. K.^^Weir, John M.^^Izac, Edouard Victor Michel",,"1 silver gelatin print Image size: 4 1/2"" x 6 9/16"";  Paper size: 5"" x 7 1/8"" stained, scratches, worn edges.  Reverse of photo: paper  label, writing.",,"5 -  1 - 1945","Emory University^^Encoded as part of the SAGE Digital Archive Project: A Collaborative Project between the Georgia Institute of Technology and Emory University, 1997-2000.^^Funding for the SAGE Digital Archive Project was provided by a local foundation.","Researchers should contact the repository for terms governing the use of the collection.","Negative.  TIFF image (400 dpi).  JPG image (72 dpi).","JPG (72 dpi); 56 KB  Digital image created as part of SAGE project, 1998.",,,,,,,,,,,,,,,,,,,,,,,,,,,,,,,,,,,,,"Beeson, J. K.,Brooks, C. Wayland,Dora (Concentration camp),Izac, Edouard Victor Michel,Nordhausen (Concentration camp),United States--Congress--Joint Committee on Conditions in Concentration Camps in Germany,Vorys, John M.,Weir, John M.",https://witness.digitalscholarship.emory.edu/files/original/86a55144577b33ae0ab13d49a535ab76.JPG,"Still Image",Photographs,1,0
622,https://witness.digitalscholarship.emory.edu/items/show/622,"Congressional delegation visits an underground V-bomb factory at Nordhausen","Izac, Edouard Victor Michel (Donor)^^United States--Army--Signal Corps (Photographer)","Content Note: Caption from a separate page: ""American Congressmen who came to Europe to see an underground V-bomb factory at Nordhausen, Germany.  Here, in a forest of V-2 tail assemblies are (L-R) Sen. Leverett Saltonstall (R-Mass); Maj. H. A. Beckley; Maj. Gen. Wilton B. Persons; Sen. Kenneth S. Wherry (R-Neb); Sen. C. Wayland Brooks (R-Ill); Rep. Ed. V. Izac (D-Calif); Rep. John M. Vorys (R-Ohio); Lt. Col. J. K. Beeson; Brig. Gen. John M. Weir, War Dept. representative; and Maj. Gen. L. W. Rooks, SHAEF.""  Numbered 17 on the reverse (Izac 44)","06080100PHNO00IZACED007^^ 06080100PHNO00IZACED007.JPG ","United States--Congress--Joint Committee on Conditions in Concentration Camps in Germany^^Nordhausen (Concentration camp)^^Dora (Concentration camp)^^Saltonstall, Leverett^^Beckley, H. A.^^Persons, Wilton B.^^Wherry, Kenneth Spicer^^Brooks, C. Wayland^^Vorys, John M.^^Beeson, J. K.^^Weir, John M.^^Rooks, Lowell W.^^Izac, Edouard Victor Michel",,"1 silver gelatin print Image size: 4 1/2"" x 6 9/16"";  Paper size: 5"" x 7 1/8"" bent, scratches.  Reverse of photo: paper label, writing.",,"5 -  1 - 1945","Emory University^^Encoded as part of the SAGE Digital Archive Project: A Collaborative Project between the Georgia Institute of Technology and Emory University, 1997-2000.^^Funding for the SAGE Digital Archive Project was provided by a local foundation.","Researchers should contact the repository for terms governing the use of the collection.","Negative.  TIFF image (400 dpi).  JPG image (72 dpi).","JPG (72 dpi); 47 KB  Digital image created as part of SAGE project, 1998.",,,,,,,,,,,,,,,,,,,,,,,,,,,,,,,,,,,,,"Beckley, H. A.,Beeson, J. K.,Brooks, C. Wayland,Dora (Concentration camp),Izac, Edouard Victor Michel,Nordhausen (Concentration camp),Persons, Wilton B.,Rooks, Lowell W.,Saltonstall, Leverett,United States--Congress--Joint Committee on Conditions in Concentration Camps in Germany,Vorys, John M.,Weir, John M.,Wherry, Kenneth Spicer",https://witness.digitalscholarship.emory.edu/files/original/c9fb79d8453eace1c6d9492114cc71cb.JPG,"Still Image",Photographs,1,0
616,https://witness.digitalscholarship.emory.edu/items/show/616,"Congressional delegation walking through Camp Dora at Nordhausen, Germany","Izac, Edouard Victor Michel (Donor)^^United States--Army--Signal Corps (Photographer)","Content Note: Caption from a separate page: ""American congressmen investigating German atrocities walk through the infamous camp Dora concentration camp at Nordhausen, Germany.""  The delegation and U. S. Army officials walk down a road through the camp.  They all wear Army helmets. They are followed by survivors or civilians.  In the background laundry is hanging from lines strung between trees.  U. S. Army Signal Corps photograph [?].  Numbered 11 on the reverse (Izac 35)","06080100PHNO00IZACED001^^ 06080100PHNO00IZACED001.JPG ","United States--Congress--Joint Committee on Conditions in Concentration Camps in Germany^^Nordhausen (Concentration camp)^^Dora (Concentration camp)^^United States--Army--Signal Corps^^Izac, Edouard Victor Michel",,"1 silver gelatin print Image size: 4 1/2"" x 6 1/2"";  Paper size: 5"" x 6 3/4"" worn edges.  Reverse of photo: paper label, writing.",,"1 -  1 - 1945","Emory University^^Encoded as part of the SAGE Digital Archive Project: A Collaborative Project between the Georgia Institute of Technology and Emory University, 1997-2000.^^Funding for the SAGE Digital Archive Project was provided by a local foundation.","Researchers should contact the repository for terms governing the use of the collection.","Negative.  TIFF image (400 dpi).  JPG image (72 dpi).","JPG (72 dpi); 43 KB  Digital image created as part of SAGE project, 1998.",,,,,,,,,,,,,,,,,,,,,,,,,,,,,,,,,,,,,"Dora (Concentration camp),Izac, Edouard Victor Michel,Nordhausen (Concentration camp),United States--Army--Signal Corps,United States--Congress--Joint Committee on Conditions in Concentration Camps in Germany",https://witness.digitalscholarship.emory.edu/files/original/847e973347eee7d325bc5f2c6091b926.JPG,"Still Image",Photographs,1,0
62,https://witness.digitalscholarship.emory.edu/items/show/62,"Congressman Edouard V. M. Izac (R-CA) interview","Crawford, Fred Roberts (Interviewer)^^Izac, Edouard Victor Michel (Interviewee)","Content Note: Transcript of a video recording.  Izac was a member of the Naval Affairs Committee in 1945.  He served on the congressional committee requested by General Dwight D. Eisenhower in 1945 to visit several concentration camps shortly after their liberation.  As a member of that committee, he visited Dachau, Buchenwald and Nordhausen.  Location of interview: Bethesda, Mayland.","06080100CFLI00052001000^^ 06080100CFLI00052001000.PDF ","Buchenwald (Concentration camp)^^Nordhausen (Concentration camp)^^Dachau (Concentration camp)^^United States--Congress--Joint Committee on Conditions in Concentration Camps in Germany^^Dora (Concentration camp)^^Eisenhower, Dwight D. (Dwight David)^^Crawford, Fred Roberts^^Izac, Edouard Victor Michel",,"10 pages (oral history transcript) Typescript with handwritten edits.",,"5 -  7 - 1981","Emory University^^Encoded as part of the SAGE Digital Archive Project: A Collaborative Project between the Georgia Institute of Technology and Emory University, 1997-2000.^^Funding for the SAGE Digital Archive Project was provided by a local foundation.","Researchers should contact the repository for terms governing the use of the collection.","PDF file (72 dpi).","PDF (72 dpi); 1500 KB  Digital image created as part of SAGE project, 1998.",,,,,,,,,,,,,,,,,,,,,,,,,,,,,,,,,,,,,"Buchenwald (Concentration camp),Crawford, Fred Roberts,Dachau (Concentration camp),Dora (Concentration camp),Eisenhower, Dwight D. (Dwight David),Izac, Edouard Victor Michel,Nordhausen (Concentration camp),United States--Congress--Joint Committee on Conditions in Concentration Camps in Germany","https://witness.digitalscholarship.emory.edu/files/original/d8ee65970a57653fd7c21dfdf9320774.pdf,https://witness.digitalscholarship.emory.edu/files/original/5065a76a529ba213f903eba4b13a7c59.GIF,https://witness.digitalscholarship.emory.edu/files/original/d8690abaaea98c3afd200d9e37212b32.GIF,https://witness.digitalscholarship.emory.edu/files/original/2254efcd59fb1c2ab986e38ae205e53e.GIF,https://witness.digitalscholarship.emory.edu/files/original/d95530668803404f70b1768838b899a0.GIF,https://witness.digitalscholarship.emory.edu/files/original/978408e95bd75735a435da50f1a2bd2f.GIF,https://witness.digitalscholarship.emory.edu/files/original/4832e0b379421a497dd910a5712325a7.GIF,https://witness.digitalscholarship.emory.edu/files/original/d4de5c1a93d78fefec8e5889666dcd26.GIF,https://witness.digitalscholarship.emory.edu/files/original/a4d44f42e085168c3ebec6b2be542407.GIF,https://witness.digitalscholarship.emory.edu/files/original/f521c5e67f70810f2f963076e080e08b.GIF,https://witness.digitalscholarship.emory.edu/files/original/7bc40b6dd18e4760e9e8f60b74bc4079.GIF,https://witness.digitalscholarship.emory.edu/files/original/85d4ed7ce5e10de679b4437b11993b38.txt",Text,Interviews,1,0
485,https://witness.digitalscholarship.emory.edu/items/show/485,"Members of Congressional party view spot where POWs were shot  [Dachau]","Izac, Edouard Victor Michel (Donor)","Content Note: Caption from a separate page: ""Members of Congressional party now investigating Nazi POW atrocities in Germany view the spot where POWs were shot.  Sen. Brooks points to spot saturated with blood at this camp at Dachau.  With him are Maj. Gen. Persons who is conducting the tour, Rep. James P. Richards, Rep. Vorys, Sen. James R. Richards [sic], Kenneth Wherry.""  The Congressmen stand in a line looking at an earthen embankment. Numbered 95 on the reverse (Izac 60).","06080100PHDA00IZACED002^^ 06080100PHDA00IZACED002.JPG ","Dachau (Concentration camp)^^United States--Congress--Joint Committee on Conditions in Concentration Camps in Germany^^Brooks, C. Wayland^^Persons, Wilton B.^^Richards, James P.^^Vorys, John M.^^Wherry, Kenneth Spicer^^Izac, Edouard Victor Michel",,"1 silver gelatin print Image size: 4 1/2"" x 6 1/2"";  Paper size: 4 3/4"" x 6 1/2"" bent, cracked, scratches, fingerprints, impression from  writing on reverse of photo, damage on negative.  Reverse of  photo: paper label, writing.",,"5 -  3 - 1945","Emory University^^Encoded as part of the SAGE Digital Archive Project: A Collaborative Project between the Georgia Institute of Technology and Emory University, 1997-2000.^^Funding for the SAGE Digital Archive Project was provided by a local foundation.","Researchers should contact the repository for terms governing the use of the collection.","Negative.  TIFF image (400 dpi).  JPG image (72 dpi).","JPG (72 dpi); 59 KB  Digital image created as part of SAGE project, 1998.",,,,,,,,,,,,,,,,,,,,,,,,,,,,,,,,,,,,,"Brooks, C. Wayland,Dachau (Concentration camp),Izac, Edouard Victor Michel,Persons, Wilton B.,Richards, James P.,United States--Congress--Joint Committee on Conditions in Concentration Camps in Germany,Vorys, John M.,Wherry, Kenneth Spicer",https://witness.digitalscholarship.emory.edu/files/original/b577f501f1afd7c95a1afdf546b11a3a.JPG,"Still Image",Photographs,1,0
