﻿"Item Id","Item URI","Dublin Core:Title","Dublin Core:Creator","Dublin Core:Description","Dublin Core:Identifier","Dublin Core:Subject","Dublin Core:Coverage","Dublin Core:Source","Dublin Core:Publisher","Dublin Core:Date","Dublin Core:Contributor","Dublin Core:Rights","Dublin Core:Relation","Dublin Core:Format","Dublin Core:Language","Dublin Core:Type","Item Type Metadata:Lesson Plan Text","Item Type Metadata:Bibliography","Item Type Metadata:Biographical Text","Item Type Metadata:Occupation","Item Type Metadata:Death Date","Item Type Metadata:Birthplace","Item Type Metadata:Birth Date","Item Type Metadata:Participants","Item Type Metadata:Event Type","Item Type Metadata:URL","Item Type Metadata:Bit Rate/Frequency","Item Type Metadata:Interviewer","Item Type Metadata:Interviewee","Item Type Metadata:Location","Item Type Metadata:Transcription","Item Type Metadata:Local URL","Item Type Metadata:Original Format","Item Type Metadata:Physical Dimensions","Item Type Metadata:Duration","Item Type Metadata:Compression","Item Type Metadata:Producer","Item Type Metadata:Director","Item Type Metadata:Text","Item Type Metadata:Time Summary","Item Type Metadata:Email Body","Item Type Metadata:Subject Line","Item Type Metadata:From","Item Type Metadata:To","Item Type Metadata:CC","Item Type Metadata:BCC","Item Type Metadata:Number of Attachments","Item Type Metadata:Standards","Item Type Metadata:Objectives","Item Type Metadata:Materials",tags,file,itemType,collection,public,featured
605,https://witness.digitalscholarship.emory.edu/items/show/605,"""Members of congressional committee... view the wreckage of a German synthetic gasoline plant at Scholven""","Izac, Edouard Victor Michel (Donor)^^United States--Army--Signal Corps (Photographer)","Content Note: Title from caption on a separate page.  Additional caption text: ""Hydrieriverke, Scholven, Germany.  Members of congressional committee who are touring the E.T.O. view the wreckage of a German synthetic gasoline plant at Scholven which was destroyed by Allied Air attacks.  Here with a group of the German directors of the camp are Saltonstall, Short, wearing helmets at right of the group.""  The group stands together in front of the ruins of a building.  Numbered 10 on the reverse (Izac 48)","06080100PHMI00IZACED007^^ 06080100PHMI00IZACED007.JPG ","United States--Congress--Joint Committee on Conditions in Concentration Camps in Germany^^United States--Army--Signal Corps^^Saltonstall, Leverett^^Short, Dewey J.^^Izac, Edouard Victor Michel","Scholven (Germany)","1 silver gelatin print Image size: 4 1/2"" x 6 1/2"";  Paper size: 5"" x 7"" bent, cracked, scratches, top edge of photograph is uneven as  if ripped along a ruler.  Reverse of photo: paper label,  writing.",,"5 -  1 - 1945","Emory University^^Encoded as part of the SAGE Digital Archive Project: A Collaborative Project between the Georgia Institute of Technology and Emory University, 1997-2000.^^Funding for the SAGE Digital Archive Project was provided by a local foundation.","Researchers should contact the repository for terms governing the use of the collection.","Negative.  TIFF image (400 dpi).  JPG image (72 dpi).","JPG (72 dpi); 92 KB  Digital image created as part of SAGE project, 1998.",,,,,,,,,,,,,,,,,,,,,,,,,,,,,,,,,,,,,"Izac, Edouard Victor Michel,Saltonstall, Leverett,Scholven (Germany),Short, Dewey J.,United States--Army--Signal Corps,United States--Congress--Joint Committee on Conditions in Concentration Camps in Germany",https://witness.digitalscholarship.emory.edu/files/original/e0b39cf508ba47677382b74dcc5e2e4c.JPG,"Still Image",Photographs,1,0
607,https://witness.digitalscholarship.emory.edu/items/show/607,"""Members of the congressional committee... talk with General George S. Patton... at his headquarters in Germany""","Izac, Edouard Victor Michel (Donor)^^United States--Army--Signal Corps (Photographer)","Content Note: Title from caption on a separate page.  Additional caption text: ""Members of the congressional committee who came from US to investigate the Nazi atrocities talk with General George S. Patton, 3rd Army CG, at his headquarters in Germany (Erlangen, Ger.).  L-  R: Brooks, Maj. Gen. Wilston S. Persons [sic], Patton, Wherry, Vorys, Richards.""  They stand in a doorway.  General Patton appears to be addressing the congressmen.  The congressmen have round tags attached to their coats with string.  Numbered 11 on the reverse (Izac 50)","06080100PHMI00IZACED009^^ 06080100PHMI00IZACED009.JPG ","United States--Congress--Joint Committee on Conditions in Concentration Camps in Germany^^United States--Army--Signal Corps^^Patton, George S. (George Smith)^^Brooks, C. Wayland^^Persons, Wilton B.^^Wherry, Kenneth Spicer^^Vorys, John M.^^Richards, James P.^^Izac, Edouard Victor Michel","Erlangen (Germany)","1 silver gelatin print Image size: 4 1/2"" x 6 1/2"";  Paper size: 5"" x 7"" bent, stained, scratches, finger prints, left and bottom edges  of photograph are uneven as if ripped along a ruler.  Reverse  of photo: paper label, writing.",,"5 -  2 - 1945","Emory University^^Encoded as part of the SAGE Digital Archive Project: A Collaborative Project between the Georgia Institute of Technology and Emory University, 1997-2000.^^Funding for the SAGE Digital Archive Project was provided by a local foundation.","Researchers should contact the repository for terms governing the use of the collection.","Negative.  TIFF image (400 dpi).  JPG image (72 dpi).","JPG (72 dpi); 71 KB  Digital image created as part of SAGE project, 1998.",,,,,,,,,,,,,,,,,,,,,,,,,,,,,,,,,,,,,"Brooks, C. Wayland,Erlangen (Germany),Izac, Edouard Victor Michel,Patton, George S. (George Smith),Persons, Wilton B.,Richards, James P.,United States--Army--Signal Corps,United States--Congress--Joint Committee on Conditions in Concentration Camps in Germany,Vorys, John M.,Wherry, Kenneth Spicer",https://witness.digitalscholarship.emory.edu/files/original/c33025ce094f3965b98ccade2fe166df.JPG,"Still Image",Photographs,1,0
599,https://witness.digitalscholarship.emory.edu/items/show/599,"""Party of 12 Legislators as they arrived in Europe""","Izac, Edouard Victor Michel (Donor)","Content Note: Title from caption on a separate sheet.  Additional caption text: ""L-R: [front] Short, Thomason, George, Barkley, Mott, Richards, Izac, Thomas.  [on stairs] Saltonstall, Wherry, Brooks, Vorys.  Paris, France.""  Congressional Joint Committee on Conditions in Concentration Camps in Germany arrive in Europe.  They pose in front of their plane. Numbered 7 on the reverse (Izac 3)","06080100PHMI00IZACED001^^ 06080100PHMI00IZACED001.JPG ","United States--Congress--Joint Committee on Conditions in Concentration Camps in Germany^^Short, Dewey J.^^Thomason, R. Ewing^^George, Walter F. (Walter Franklin)^^Barkley, Alben William^^Mott, James Wheaton^^Richards, James P.^^Thomas, Elbert D.^^Saltonstall, Leverett^^Wherry, Kenneth Spicer^^Brooks, C. Wayland^^Vorys, John M.^^Izac, Edouard Victor Michel",,"1 silver gelatin print Image size: 4 1/2"" x 6 1/2"";  Paper size: 5"" x 7"" scratches.  Reverse of photo: slight age discoloration, paper  label, writing.",,"4 -  23 - 1945","Emory University^^Encoded as part of the SAGE Digital Archive Project: A Collaborative Project between the Georgia Institute of Technology and Emory University, 1997-2000.^^Funding for the SAGE Digital Archive Project was provided by a local foundation.","Researchers should contact the repository for terms governing the use of the collection.","Negative.  TIFF image (400 dpi).  JPG image (72 dpi).","JPG (72 dpi); 39 KB  Digital image created as part of SAGE project, 1998.",,,,,,,,,,,,,,,,,,,,,,,,,,,,,,,,,,,,,"Barkley, Alben William,Brooks, C. Wayland,George, Walter F. (Walter Franklin),Izac, Edouard Victor Michel,Mott, James Wheaton,Richards, James P.,Saltonstall, Leverett,Short, Dewey J.,Thomas, Elbert D.,Thomason, R. Ewing,United States--Congress--Joint Committee on Conditions in Concentration Camps in Germany,Vorys, John M.,Wherry, Kenneth Spicer",https://witness.digitalscholarship.emory.edu/files/original/cfd55702fba3c5d79fd14a49e2e2c4ac.JPG,"Still Image",Photographs,1,0
603,https://witness.digitalscholarship.emory.edu/items/show/603,"""Rep. Izac talks to four repatriated American soldiers""","Izac, Edouard Victor Michel (Donor)","Content Note: Title from caption on a separate page.  Additional caption text: ""Rep. Izac talks to four repatriated American soldiers who are being returned to the U.S.  L-R: Pvt. Anthony D. Alves, Pvt. John Pini, Pvt. Carleton Hardy, PFC Joe H. Funk.""  Written on reverse: ""Lucky Strike, France"".  Izac and the soldiers sit together on two cots.  Izac has his hands clasped in his lap, and his eyes are closed.  He appears to be speaking.  The soldiers are looking at him.  Numbered 12 on the reverse (Izac 12)","06080100PHMI00IZACED005^^ 06080100PHMI00IZACED005.JPG ","United States--Congress--Joint Committee on Conditions in Concentration Camps in Germany^^Alves, Anthony D.^^Pini, John^^Hardy, Carleton^^Funk, Joe H.^^Izac, Edouard Victor Michel",,"1 silver gelatin print Image size: 4 1/2"" x 6 1/2"";  Paper size: 5"" x 7"" bent, cracked, stained, scratches.  Reverse of photo: paper  label torn from back leaving paper backing, writing.",,"4 -  28 - 1945","Emory University^^Encoded as part of the SAGE Digital Archive Project: A Collaborative Project between the Georgia Institute of Technology and Emory University, 1997-2000.^^Funding for the SAGE Digital Archive Project was provided by a local foundation.","Researchers should contact the repository for terms governing the use of the collection.","Negative.  TIFF image (400 dpi).  JPG image (72 dpi).","JPG (72 dpi); 64 KB  Digital image created as part of SAGE project, 1998.",,,,,,,,,,,,,,,,,,,,,,,,,,,,,,,,,,,,,"Alves, Anthony D.,Funk, Joe H.,Hardy, Carleton,Izac, Edouard Victor Michel,Pini, John,United States--Congress--Joint Committee on Conditions in Concentration Camps in Germany",https://witness.digitalscholarship.emory.edu/files/original/9b974947f4ff07593d2b89876a629a9d.JPG,"Still Image",Photographs,1,0
366,https://witness.digitalscholarship.emory.edu/items/show/366,"""Representative Izac looks at skulls and bodies... in an incinerator""  [Buchenwald]","Izac, Edouard Victor Michel (Donor)^^United States--Army--Signal Corps (Photographer)","Content Note: Title from caption on a separate page.  Additional caption text: ""Rep. Izac looks at skulls and bodies of prisoners in an incinerator at the infamous Buchenwald Nazi concentration camp near Weimar.  Rep. Izac is a member of a congressional group witnessing evidence of Nazi atrocities.""  Close-up of Rep. Izac looking into an incinerator containing human remains.  The contents of the incinerator are visible through the open doors.  Numbered 28 on the reverse (Izac 9)","06080100PHBU00IZACED004^^ 06080100PHBU00IZACED004.JPG ","Buchenwald (Concentration camp)^^United States--Congress--Joint Committee on Conditions in Concentration Camps in Germany^^United States--Army--Signal Corps^^Izac, Edouard Victor Michel",,"1 silver gelatin print Image size: 4 1/2"" x 6 1/2"";  Paper size: 5"" x 7 1/8"" bent, scratches, fingerprints, damage on negative.  Reverse of  photo: paper label, writing.",,"4 -  24 - 1945","Emory University^^Encoded as part of the SAGE Digital Archive Project: A Collaborative Project between the Georgia Institute of Technology and Emory University, 1997-2000.^^Funding for the SAGE Digital Archive Project was provided by a local foundation.","Researchers should contact the repository for terms governing the use of the collection.","Negative.  TIFF image (400 dpi).  JPG image (72 dpi).","JPG (72 dpi); 55 KB  Digital image created as part of SAGE project, 1998.",,,,,,,,,,,,,,,,,,,,,,,,,,,,,,,,,,,,,"Buchenwald (Concentration camp),Izac, Edouard Victor Michel,United States--Army--Signal Corps,United States--Congress--Joint Committee on Conditions in Concentration Camps in Germany",https://witness.digitalscholarship.emory.edu/files/original/5295da3b58895e97bf7b04ed2b896f44.JPG,"Still Image",Photographs,1,0
606,https://witness.digitalscholarship.emory.edu/items/show/606,"""Senators and representatives of the U.S. Congress... are welcomed by Maj. Gen. Lowell W. Rooks""","Izac, Edouard Victor Michel (Donor)","Content Note: Title from caption on a separate page.  Additional caption text: ""Senators and representatives of the U.S. Congress have arrived in Germany to investigate conditions in the concentration camps and D.P. camps are welcomed by Maj. Gen. Lowell W. Rooks.  They proceeded at once to a nearby Russian refugee camp where they had a talk with a Russian colonel in charge. Then the party headed for Seventh Army headquarters where Lt. Gen. Alexander M. Patch received them.  After a short stay, Gen. Patch accompanied the party to Munich where it will visit Dachau.  Gen. Patch is with Izac and Short.""  They are standing together near a multi-story building.  Numbered 13 on the reverse (Izac 51)","06080100PHMI00IZACED008^^ 06080100PHMI00IZACED008.JPG ","United States--Congress--Joint Committee on Conditions in Concentration Camps in Germany^^Rooks, Lowell W.^^Patch, Alexander McCarrell^^Short, Dewey J.^^Izac, Edouard Victor Michel",Germany,"1 silver gelatin print Image size: 4 1/2"" x 6 1/2"";  Paper size: 5"" x 7"" bent, scratches, moisture wrinkling, bottom edge of photograph  is uneven as if ripped along a ruler.  Reverse of photo:  paper label, writing.",,"5 -  2 - 1945","Emory University^^Encoded as part of the SAGE Digital Archive Project: A Collaborative Project between the Georgia Institute of Technology and Emory University, 1997-2000.^^Funding for the SAGE Digital Archive Project was provided by a local foundation.","Researchers should contact the repository for terms governing the use of the collection.","Negative.  TIFF image (400 dpi).  JPG image (72 dpi).","JPG (72 dpi); 61 KB  Digital image created as part of SAGE project, 1998.",,,,,,,,,,,,,,,,,,,,,,,,,,,,,,,,,,,,,"Germany,Izac, Edouard Victor Michel,Patch, Alexander McCarrell,Rooks, Lowell W.,Short, Dewey J.,United States--Congress--Joint Committee on Conditions in Concentration Camps in Germany",https://witness.digitalscholarship.emory.edu/files/original/e5e1c8c119a0731fe11ca9b1f5ffdb5e.JPG,"Still Image",Photographs,1,0
609,https://witness.digitalscholarship.emory.edu/items/show/609,"""Two Germans place another body of slave laborer beside a row of 30 bodies of Russian and Polish women slave laborers exhumed for identification in Helmbrechts, Germany""","Izac, Edouard Victor Michel (Donor)","Content Note: Title from caption on a separate page.  Additional caption text: ""A Russian woman who was forced to dig the graves and help bury the women led American authorities to the graves. Americans rounded up German civilians to exhume the bodies for ID and decent burial.""  The row of corpses lies in a wooded area.  Numbered 3 on the reverse (Izac 78)","06080100PHMI00IZACED011^^ 06080100PHMI00IZACED011.JPG ","Izac, Edouard Victor Michel","Helmbrechts (Germany)","1 silver gelatin print Image size: 4 1/2"" x 6 1/2"";  Paper size: 5"" x 7"" bent, scratches, impression of writing on back is visible on  front of photograph, moisture wrinkling, top and right edges  of photograph are uneven as if ripped along a ruler.  Reverse  of photo: paper label, writing.",,"0 -  0 - 1945","Emory University^^Encoded as part of the SAGE Digital Archive Project: A Collaborative Project between the Georgia Institute of Technology and Emory University, 1997-2000.^^Funding for the SAGE Digital Archive Project was provided by a local foundation.","Researchers should contact the repository for terms governing the use of the collection.","Negative.  TIFF image (400 dpi).  JPG image (72 dpi).","JPG (72 dpi); 108 KB  Digital image created as part of SAGE project, 1998.",,,,,,,,,,,,,,,,,,,,,,,,,,,,,,,,,,,,,"Helmbrechts (Germany),Izac, Edouard Victor Michel",https://witness.digitalscholarship.emory.edu/files/original/cc891ccfef715ca562992f6114daa407.JPG,"Still Image",Photographs,1,0
365,https://witness.digitalscholarship.emory.edu/items/show/365,"""U.S. legislators... hear former prisoner demonstrate how victims were... clubbed to death"" [Buchenwald]","Izac, Edouard Victor Michel (Donor)^^United States--Army--Signal Corps (Photographer)","Content Note: Title from caption on a separate page.  Additional caption text: ""U.S. legislators in Germany to witness Nazi concentration camp horrors at Buchenwald hear former prisoner demonstrate how victims were hung on hooks and then clubbed to death.  L-R: Thomason, Mott,  Brooks, Wherry, Barkley, Short, Vorys.  Former prisoner is shown holding club.""  The survivor is wearing a coat with the number 38210 on the front under a triangle and ""Lagerschutz"" on the left sleeve.  Numbered 9 on the reverse (Izac 7)","06080100PHBU00IZACED003^^ 06080100PHBU00IZACED003.JPG ","Buchenwald (Concentration camp)^^United States--Congress--Joint Committee on Conditions in Concentration Camps in Germany^^Thomason, R. Ewing^^Mott, James Wheaton^^Brooks, C. Wayland^^Wherry, Kenneth Spicer^^Barkley, Alben William^^Short, Dewey J.^^Vorys, John M.^^Izac, Edouard Victor Michel",,"1 silver gelatin print Image size: 4 1/2"" x 6 9/16"";  Paper size: 5"" x 7 1/16"" bent, scratches, damage on negative.  Reverse of photo: paper  label, writing.",,"4 -  24 - 1945","Emory University^^Encoded as part of the SAGE Digital Archive Project: A Collaborative Project between the Georgia Institute of Technology and Emory University, 1997-2000.^^Funding for the SAGE Digital Archive Project was provided by a local foundation.","Researchers should contact the repository for terms governing the use of the collection.","Negative.  TIFF image (400 dpi).  JPG image (72 dpi).","JPG (72 dpi); 46 KB  Digital image created as part of SAGE project, 1998.",,,,,,,,,,,,,,,,,,,,,,,,,,,,,,,,,,,,,"Barkley, Alben William,Brooks, C. Wayland,Buchenwald (Concentration camp),Izac, Edouard Victor Michel,Mott, James Wheaton,Short, Dewey J.,Thomason, R. Ewing,United States--Congress--Joint Committee on Conditions in Concentration Camps in Germany,Vorys, John M.,Wherry, Kenneth Spicer",https://witness.digitalscholarship.emory.edu/files/original/c49da91b7afc10cea1cd2d18b339f670.JPG,"Still Image",Photographs,1,0
608,https://witness.digitalscholarship.emory.edu/items/show/608,"Barracks for Hungarian women at Stalag II-B in Duderstadt","Izac, Edouard Victor Michel (Donor)","Content Note: Caption text from a separate page: ""Barracks for Hungarian women are placed next to a Nazi munitions factory in captured Duderstadt in direct violation of the rules of warfare and treatment of prisoners established by the Geneva Convention.  The barracks are part of Stalag II-B where prisoners were freed by troops of the First Army.""  Several barracks are visible in the foreground, and factory buildings are visible behind them.  People walk between the barracks.  Numbered 4 on the reverse (Izac 77)","06080100PHMI00IZACED010^^ 06080100PHMI00IZACED010.JPG ","Stalag II-B (Concentration camp)^^Izac, Edouard Victor Michel","Duderstadt (Germany)","1 silver gelatin print Image size: 4 1/2"" x 6 1/2"";  Paper size: 5"" x 7"" bent, scratches, stained, impression of writing on back is  visible on front of photograph, moisture wrinkling, bottom  edge of photograph is uneven as if ripped along a ruler.  Reverse of photo: paper label, writing.",,"4 -  9 - 1945","Emory University^^Encoded as part of the SAGE Digital Archive Project: A Collaborative Project between the Georgia Institute of Technology and Emory University, 1997-2000.^^Funding for the SAGE Digital Archive Project was provided by a local foundation.","Researchers should contact the repository for terms governing the use of the collection.","Negative.  TIFF image (400 dpi).  JPG image (72 dpi).","JPG (72 dpi); 65 KB  Digital image created as part of SAGE project, 1998.",,,,,,,,,,,,,,,,,,,,,,,,,,,,,,,,,,,,,"Duderstadt (Germany),Izac, Edouard Victor Michel,Stalag II-B (Concentration camp)",https://witness.digitalscholarship.emory.edu/files/original/b47a4b03acccf2b4c39d0d819ddb97c7.JPG,"Still Image",Photographs,1,0
375,https://witness.digitalscholarship.emory.edu/items/show/375,"Child survivors lead a line of older survivors to a U. S. Army medical station [Buchenwald]","Izac, Edouard Victor Michel (Donor)","Content Note: Caption from a separate page: ""Children liberated from camp lead a line of older prisoners still strong enough to walk from camp to U. S. Army medical station for treatment.""  The children appear to be walking in rows (four across).  They are wearing civilian clothes. Numbered 51 on the reverse (Izac 20)","06080100PHBU00IZACED013^^ 06080100PHBU00IZACED013.JPG ","Buchenwald (Concentration camp)^^Izac, Edouard Victor Michel",,"1 silver gelatin print Image size: 4 1/2"" x 6 1/2"";  Paper size: 5"" x 7 1/8"" bent, scratches, liquid spot has altered the finish of photo  paper (but not altered the image).  Reverse of photo: 2 paper  labels, surface torn where tape was removed, writing.",,"1 -  1 - 1945","Emory University^^Encoded as part of the SAGE Digital Archive Project: A Collaborative Project between the Georgia Institute of Technology and Emory University, 1997-2000.^^Funding for the SAGE Digital Archive Project was provided by a local foundation.","Researchers should contact the repository for terms governing the use of the collection.","Negative.  TIFF image (400 dpi).  JPG image (72 dpi).","JPG (72 dpi); 51 KB  Digital image created as part of SAGE project, 1998.",,,,,,,,,,,,,,,,,,,,,,,,,,,,,,,,,,,,,"Buchenwald (Concentration camp),Izac, Edouard Victor Michel",https://witness.digitalscholarship.emory.edu/files/original/b8436fa22c40a846386c4ee0f4b285a6.JPG,"Still Image",Photographs,1,0
